tnmo.owl
type: Ontology
creator: Stefan Schulz, Medical University of Graz, Graz, Austria
creator: Rita Faria, Department of Informatics, University of Minho, Braga, Portugal
comment: A representation of the TNM classification of malignant tumors for breast tumors.
version info: prototype 0.18
creator: Martin Boeker, University Medical Center Freiburg, Freiburg, Germany
date: 2014-07-22
publisher: Institute of Medical Biometry and Medical Informatics, University Medical Center Freiburg, Stefan-Meier-Strasse 26, 79104 Freiburg, Germany Institute of Medical Informatics, Statistics and Documentation, Medical University of Graz, Auenbruggerplatz 2/V , 8036 Graz (Austria)
imports: btl2.owl
version IRI: proto-0.18

LateralityValueRegion
type: Class
subclass of: ValueRegion
comment: corrected Plural label -> Singular label

Liver
type: Class
subclass of: Organ
definition: "Lobular organ which has as its parts lobules connected to the biliary tree. Examples: There is only one liver." - FMA

Lung
type: Class
subclass of: Organ
definition: "Lobular organ which has as its parts alveoli connected to the tracheobronchial tree. Examples: There are only two lungs, right lung and left lung." - FMA

MetastaticLymphNode
type: Class
equivalent class: Class
  intersection of: LymphNode
  intersection of: Restriction
    on property: includes
    some values from: Metastasis
subclass of: LymphNode
subclass of: Restriction
  on property: isBearerOf
  some values from: Restriction
    on property: projectsOnto
    some values from: MalignantValueRegion
subclass of: Restriction
  on property: isIncludedIn
  some values from: OrganPart
comment: removed "regional", as LN is only regional WRT some other structure

MetastaticRegionalLymphNodeOfMammaryTumor
type: Class
equivalent class: Class
  intersection of: MetastaticLymphNode
  intersection of: Restriction
    on property: includes
    some values from: MetastasisOfTumorOfMammaryGland
subclass of: MetastaticLymphNode
comment: Metastasis in regional lymph nodes of mamma

TumorAggregate
type: Class
subclass of: Class
  intersection of: AnatomicalStructure
  intersection of: Restriction
    on property: hasPart
    some values from: MalignantAnatomicalStructure
definition: Primary tumor plus all affected structures

TumorOfMammaryGlandAggregate
type: Class
equivalent class: Class
  intersection of: TumorAggregate
  intersection of: Restriction
    on property: hasPart
    some values from: TumorOfMammaryGland
definition: all those things that can be described with a TNM code for brast cancer

TumorOfMammaryGlandWithContralateralLymphNodeMetastasis
type: Class
equivalent class: Class
  union of: TumorOfLeftMammaryGlandWithRightLymphNodeMetastasis
  union of: TumorOfRightMammaryGlandWithLeftLymphNodeMetastasis
subclass of: TumorOfMammaryGlandAggregate
subclass of: Restriction
  on property: isRepresentedBy
  all values from: MammaryGlandTNM M1
subclass of: Restriction
  on property: isRepresentedBy
  all values from: MammaryGlandTNM pM1
subclass of: Restriction
  on property: hasPart
  some values from: Class
    union of: TumorOfLeftMammaryGland
    union of: TumorOfRightMammaryGland
comment: m1

TumorOfMammaryGlandWithDistantMetastasis
type: Class
equivalent class: Class
  intersection of: TumorOfMammaryGlandAggregate
  intersection of: Restriction
    on property: hasPart
    some values from: Class
      intersection of: Metastasis
      intersection of: Class
        complement of: Restriction
subclass of: Restriction
  on property: isRepresentedBy
  all values from: MammaryGlandTNM M1
subclass of: Restriction
  on property: isRepresentedBy
  all values from: MammaryGlandTNM pM1
comment: m1